intellij.localPath specified still getting error 'Could not resolve com.jetbrains:ideaLocal:IU-191.7479.19' on runIde task

Answered

I used intellij.localPath as per https://github.com/JetBrains/gradle-intellij-plugin

Since the host 'cache-redirector.jetbrains.com' is not accessible under firewall. I am getting error as below in restricted environment. Please help in this regard.

> Task :compileJava FAILED

FAILURE: Build failed with an exception.

* What went wrong:
Could not resolve all files for configuration ':compileClasspath'.
> Could not resolve com.jetbrains:ideaLocal:IU-191.7479.19.
Required by:
project :
> Could not resolve com.jetbrains:ideaLocal:IU-191.7479.19.
> com/mercury/ftjadin/hooks/interfaces/EventListenerListHookQTJA
> Could not resolve com.jetbrains:ideaLocal:IU-191.7479.19.
> Could not get resource 'https://cache-redirector.jetbrains.com/plugins.jetbrains.com/maven/com/jetbrains/ideaLocal/IU-191.7479.19/ideaLocal-IU-191.7479.19.pom'.
> Could not GET 'https://cache-redirector.jetbrains.com/plugins.jetbrains.com/maven/com/jetbrains/ideaLocal/IU-191.7479.19/ideaLocal-IU-191.7479.19.pom'.
> cache-redirector.jetbrains.com

 

build.gradle

buildscript {
repositories {
mavenLocal()
maven {
name ''
url 'internal url'
}

}
dependencies {
classpath 'org.jetbrains.intellij:org.jetbrains.intellij.gradle.plugin:0.+'

}
}

apply plugin: "org.jetbrains.intellij"
apply plugin: "java"

repositories {
mavenLocal()
maven {
name ''
url 'internal url'
}
}

sourceSets {}

intellij {
pluginName 'test-plugin'
updateSinceUntilBuild false
localPath = "<>/workspace/Intellij Versions/ideaIU-191.7479.19/"
/* downloadSources false*/ //enable for CI
}

dependencies {
testCompile group: 'junit', name: 'junit', version: '4.12'
compileOnly fileTree(dir: "<>/workspace/Intellij Versions/ideaIU-191.7479.19/lib", include: ['*.jar'])
}


patchPluginXml {
changeNotes """
Add change notes here.<br>
<em>most HTML tags may be used</em>"""
}

sourceCompatibility = 1.8
targetCompatibility = 1.8
wrapper {
gradleVersion '4.10'
}
8 comments
Comment actions Permalink
    localPath = "<>/workspace/Intellij Versions/ideaIU-191.7479.19/"

What's the content of that directory?

    compileOnly fileTree(dir: "<>/workspace/Intellij Versions/ideaIU-191.7479.19/lib", include: ['*.jar'])

This is not needed.

What's the output of `./gradlew compileJava --info`?

0
Comment actions Permalink

Hi Alexander,

Thanks for looking into this!

Contents extracted from

https://www.jetbrains.com/intellij-repository/releases/com/jetbrains/intellij/idea/ideaIU/191.7479.19/ideaIU-191.7479.19.zip

is present for both of below mentioned.

localPath = "<>/workspace/Intellij Versions/ideaIU-191.7479.19/"

and 

  compileOnly fileTree(dir: "<>/workspace/Intellij Versions/ideaIU-191.7479.19/lib", include: ['*.jar'])

 

 

Please find output as below for ` ./gradlew compileJava --info`. (Note -: To avoid confusion "<>/workspace/Intellij Versions/ideaIU-191.7479.19/"

changed to "<>/workspace/Intellij Versions/intellijIDEA/" in build.gradle)

C:\workspace\FirstGradlePlugin>gradlew compileJava --info
Picked up JAVA_TOOL_OPTIONS: -agentlib:jvmhook
Picked up _JAVA_OPTIONS: -Xrunjvmhook -Xbootclasspath/a:"C:\Program Files (x86)\Micro Focus\Unified Functional Testing\bin\java_shared\classes\jasmine.jar"
Initialized native services in: C:\setup_additionals\Gradle\native
Found daemon DaemonInfo{pid=17792, address=[de6e9073-c33f-400d-ab9a-e4c4b41b7514 port:61242, addresses:[/127.0.0.1, /0:0:0:0:0:0:0:1]], state=Idle, lastBusy=1580908929087, context=DefaultDaemonContext[uid=ce4bc110-ab7c-4e74-9cd0-62e1677b7542,javaHome=C:\Softwares\v1.8.0_192\jdk1.8.0_192,daemonRegistryDi
r=C:\setup_additionals\Gradle\daemon,pid=17792,idleTimeout=10800000,daemonOpts=-Xmx1024M,-Dfile.encoding=windows-1252,-Duser.country=US,-Duser.language=en,-Duser.variant]} however its context does not match the desired criteria.
Java home is different.
Wanted: DefaultDaemonContext[uid=null,javaHome=C:\Program Files\Java\jre1.8.0_221,daemonRegistryDir=C:\setup_additionals\Gradle\daemon,pid=11376,idleTimeout=null,daemonOpts=-Xmx1024M,-Dfile.encoding=windows-1252,-Duser.country=US,-Duser.language=en,-Duser.variant]
Actual: DefaultDaemonContext[uid=ce4bc110-ab7c-4e74-9cd0-62e1677b7542,javaHome=C:\Softwares\v1.8.0_192\jdk1.8.0_192,daemonRegistryDir=C:\setup_additionals\Gradle\daemon,pid=17792,idleTimeout=10800000,daemonOpts=-Xmx1024M,-Dfile.encoding=windows-1252,-Duser.country=US,-Duser.language=en,-Duser.va
riant]

Looking for a different daemon...
The client will now receive all logging from the daemon (pid: 13060). The daemon log file: C:\setup_additionals\Gradle\daemon\4.10\daemon-13060.out.log
Starting 6th build in daemon [uptime: 5 mins 27.822 secs, performance: 99%, no major garbage collections]
Using 4 worker leases.
Starting Build
Settings evaluated using settings file 'C:\workspace\FirstGradlePlugin\settings.gradle'.
Using local directory build cache for the root build (location = C:\setup_additionals\Gradle\caches\build-cache-1, removeUnusedEntriesAfter = 7 days).
Projects loaded. Root project using build file 'C:\workspace\FirstGradlePlugin\build.gradle'.
Included projects: [root project 'FirstGradlePlugin']
Parallel execution is an incubating feature.

> Configure project :
Evaluating root project 'FirstGradlePlugin' using build file 'C:\workspace\FirstGradlePlugin\build.gradle'.
[gradle-intellij-plugin :FirstGradlePlugin] Configuring plugin
[gradle-intellij-plugin :FirstGradlePlugin] Configuring patch plugin.xml task
[gradle-intellij-plugin :FirstGradlePlugin] Configuring prepare sandbox task
[gradle-intellij-plugin :FirstGradlePlugin] Configuring prepare sandbox task
[gradle-intellij-plugin :FirstGradlePlugin] Configuring plugin verification task
[gradle-intellij-plugin :FirstGradlePlugin] Configuring run IDE task
[gradle-intellij-plugin :FirstGradlePlugin] Configuring build searchable options task
[gradle-intellij-plugin :FirstGradlePlugin] Configuring jar searchable options task
[gradle-intellij-plugin :FirstGradlePlugin] Configuring building plugin task
[gradle-intellij-plugin :FirstGradlePlugin] Configuring publish plugin task
[gradle-intellij-plugin :FirstGradlePlugin] Configuring resources task
[gradle-intellij-plugin :FirstGradlePlugin] Configuring compile tasks
[gradle-intellij-plugin :FirstGradlePlugin] Configuring IDE dependency
[gradle-intellij-plugin :FirstGradlePlugin] Using path to locally installed IDE: 'C:/workspace/Intellij Versions/intellijIDEA'
[gradle-intellij-plugin :FirstGradlePlugin] IU-191.7479.19 is used for building
[gradle-intellij-plugin :FirstGradlePlugin] Configuring plugin dependencies
[gradle-intellij-plugin :FirstGradlePlugin] Configuring tests tasks
All projects evaluated.
Selected primary task 'compileJava' from project :
Tasks to be executed: [task ':compileJava']
:compileJava (Thread[Task worker for ':',5,main]) started.

> Task :compileJava
Resource missing. [HTTP GET: http://<internal repository host>/com/jetbrains/ideaLocal/IU-191.7479.19/ideaLocal-IU-191.7479.19.pom]

> Task :compileJava FAILED
:compileJava (Thread[Task worker for ':',5,main]) completed. Took 3.407 secs.

FAILURE: Build failed with an exception.

* What went wrong:
Could not resolve all files for configuration ':compileClasspath'.
> Could not resolve com.jetbrains:ideaLocal:IU-191.7479.19.
Required by:
project :
> Could not resolve com.jetbrains:ideaLocal:IU-191.7479.19.
> com/mercury/ftjadin/hooks/interfaces/EventListenerListHookQTJA
> Could not resolve com.jetbrains:ideaLocal:IU-191.7479.19.
> Could not get resource 'https://cache-redirector.jetbrains.com/plugins.jetbrains.com/maven/com/jetbrains/ideaLocal/IU-191.7479.19/ideaLocal-IU-191.7479.19.pom'.
> Could not GET 'https://cache-redirector.jetbrains.com/plugins.jetbrains.com/maven/com/jetbrains/ideaLocal/IU-191.7479.19/ideaLocal-IU-191.7479.19.pom'.
> cache-redirector.jetbrains.com
> Could not resolve com.jetbrains:ideaLocal:IU-191.7479.19.
> Could not get resource 'https://<internal repository>/com/jetbrains/ideaLocal/IU-191.7479.19/ideaLocal-IU-191.7479.19.pom'.
> Could not GET 'https://<internal repository>/com/jetbrains/ideaLocal/IU-191.7479.19/ideaLocal-IU-191.7479.19.pom'.
> sun.security.validator.ValidatorException: PKIX path building failed: sun.security.provider.certpath.SunCertPathBuilderException: unable to find valid certification path to requested target

* Try:
Run with --stacktrace option to get the stack trace. Run with --debug option to get more log output. Run with --scan to get full insights.

* Get more help at https://help.gradle.org

BUILD FAILED in 5s
1 actionable task: 1 executed

Unknown host 'cache-redirector.jetbrains.com'. You may need to adjust the proxy settings in Gradle.

0
Comment actions Permalink

Contents extracted from

Please show the actual content. couple nested `ls` or `tree` would be ok

> and compileOnly fileTree(dir: "<>/workspace/Intellij Versions/ideaIU-1

You don't need it, remove.

Is this the entire build.gradle that you have? What gradle-intellij-plugin do you use?

0
Comment actions Permalink

Also, add `--stacktrace`.

It's ok that gradle checks `cache-redirector.jetbrains.com` and it's ok not to find anything there. But looks like your build is dead when it checks it. If it is so, try to fix the exception or try to upgrade java or gradle.

0
Comment actions Permalink

actual content. couple nested `ls` or `tree` 

> and compileOnly fileTree(dir: "<>/workspace/Intellij Versions/ideaIU-1

$ dir
bin ipr.reg
build.txt lib
dependencies.txt license
help MacOS
ideaLocal-IU-191.7479.19-withKotlin.xml plugins
Info.plist product-info.json
Install-Linux-tar.txt redist
Install-Windows-zip.txt Resources

 

Also, add `--stacktrace`.

C:\workspace\FirstGradlePlugin>gradlew compileJava --info --stacktrace
Picked up JAVA_TOOL_OPTIONS: -agentlib:jvmhook
Picked up _JAVA_OPTIONS: -Xrunjvmhook -Xbootclasspath/a:"C:\Program Files (x86)\Micro Focus\Unified Functional Testing\bin\java_shared\classes\jasmine.jar"
Initialized native services in: C:\setup_additionals\Gradle\native
Found daemon DaemonInfo{pid=17792, address=[de6e9073-c33f-400d-ab9a-e4c4b41b7514 port:61242, addresses:[/127.0.0.1, /0:0:0:0:0:0:0:1]], state=Idle, lastBusy=1580908929087, context=DefaultDaemonContext[uid=ce4bc110-ab7c-4e74-9cd0-62e1677b7542,javaHome=C:\Softwares\v1.8.0_192\jdk1.8.0_192,daemonRegistryDi
r=C:\setup_additionals\Gradle\daemon,pid=17792,idleTimeout=10800000,daemonOpts=-Xmx1024M,-Dfile.encoding=windows-1252,-Duser.country=US,-Duser.language=en,-Duser.variant]} however its context does not match the desired criteria.
Java home is different.
Wanted: DefaultDaemonContext[uid=null,javaHome=C:\Program Files\Java\jre1.8.0_221,daemonRegistryDir=C:\setup_additionals\Gradle\daemon,pid=16660,idleTimeout=null,daemonOpts=-Xmx1024M,-Dfile.encoding=windows-1252,-Duser.country=US,-Duser.language=en,-Duser.variant]
Actual: DefaultDaemonContext[uid=ce4bc110-ab7c-4e74-9cd0-62e1677b7542,javaHome=C:\Softwares\v1.8.0_192\jdk1.8.0_192,daemonRegistryDir=C:\setup_additionals\Gradle\daemon,pid=17792,idleTimeout=10800000,daemonOpts=-Xmx1024M,-Dfile.encoding=windows-1252,-Duser.country=US,-Duser.language=en,-Duser.va
riant]

Looking for a different daemon...
The client will now receive all logging from the daemon (pid: 13060). The daemon log file: C:\setup_additionals\Gradle\daemon\4.10\daemon-13060.out.log
Starting 9th build in daemon [uptime: 1 hrs 7 mins 25.918 secs, performance: 100%, no major garbage collections]
Using 4 worker leases.
Starting Build
Settings evaluated using settings file 'C:\workspace\FirstGradlePlugin\settings.gradle'.
Using local directory build cache for the root build (location = C:\setup_additionals\Gradle\caches\build-cache-1, removeUnusedEntriesAfter = 7 days).
Projects loaded. Root project using build file 'C:\workspace\FirstGradlePlugin\build.gradle'.
Included projects: [root project 'FirstGradlePlugin']
Parallel execution is an incubating feature.

> Configure project :
Evaluating root project 'FirstGradlePlugin' using build file 'C:\workspace\FirstGradlePlugin\build.gradle'.
[gradle-intellij-plugin :FirstGradlePlugin] Configuring plugin
[gradle-intellij-plugin :FirstGradlePlugin] Configuring patch plugin.xml task
[gradle-intellij-plugin :FirstGradlePlugin] Configuring prepare sandbox task
[gradle-intellij-plugin :FirstGradlePlugin] Configuring prepare sandbox task
[gradle-intellij-plugin :FirstGradlePlugin] Configuring plugin verification task
[gradle-intellij-plugin :FirstGradlePlugin] Configuring run IDE task
[gradle-intellij-plugin :FirstGradlePlugin] Configuring build searchable options task
[gradle-intellij-plugin :FirstGradlePlugin] Configuring jar searchable options task
[gradle-intellij-plugin :FirstGradlePlugin] Configuring building plugin task
[gradle-intellij-plugin :FirstGradlePlugin] Configuring publish plugin task
[gradle-intellij-plugin :FirstGradlePlugin] Configuring resources task
[gradle-intellij-plugin :FirstGradlePlugin] Configuring compile tasks
[gradle-intellij-plugin :FirstGradlePlugin] Configuring IDE dependency
[gradle-intellij-plugin :FirstGradlePlugin] Using path to locally installed IDE: 'C:/workspace/Intellij Versions/intellijIDEA'
[gradle-intellij-plugin :FirstGradlePlugin] IU-191.7479.19 is used for building
[gradle-intellij-plugin :FirstGradlePlugin] Configuring plugin dependencies
[gradle-intellij-plugin :FirstGradlePlugin] Configuring tests tasks
All projects evaluated.
Selected primary task 'compileJava' from project :
Tasks to be executed: [task ':compileJava']
:compileJava (Thread[Task worker for ':',5,main]) started.

> Task :compileJava
Resource missing. [HTTP GET: http://<internal repo path>/com/jetbrains/ideaLocal/IU-191.7479.19/ideaLocal-IU-191.7479.19.pom]
Resource missing. [HTTP HEAD: http://<internal repo path>/com/jetbrains/ideaLocal/IU-191.7479.19/ideaLocal-IU-191.7479.19.jar]
Resource missing. [HTTP GET: http://<internal repo path>/com/jetbrains/ideaLocal/IU-191.7479.19/ideaLocal-IU-191.7479.19.pom]
Resource missing. [HTTP HEAD: http://<internal repo path>/com/jetbrains/ideaLocal/IU-191.7479.19/ideaLocal-IU-191.7479.19.jar]

> Task :compileJava FAILED
:compileJava (Thread[Task worker for ':',5,main]) completed. Took 4.234 secs.

FAILURE: Build failed with an exception.

* What went wrong:
Could not resolve all files for configuration ':compileClasspath'.
> Could not resolve com.jetbrains:ideaLocal:IU-191.7479.19.
Required by:
project :
> Could not resolve com.jetbrains:ideaLocal:IU-191.7479.19.
> com/mercury/ftjadin/hooks/interfaces/EventListenerListHookQTJA
> Could not resolve com.jetbrains:ideaLocal:IU-191.7479.19.
> Could not get resource 'https://cache-redirector.jetbrains.com/plugins.jetbrains.com/maven/com/jetbrains/ideaLocal/IU-191.7479.19/ideaLocal-IU-191.7479.19.pom'.
> Could not GET 'https://cache-redirector.jetbrains.com/plugins.jetbrains.com/maven/com/jetbrains/ideaLocal/IU-191.7479.19/ideaLocal-IU-191.7479.19.pom'.
> cache-redirector.jetbrains.com
> Could not resolve com.jetbrains:ideaLocal:IU-191.7479.19.
> Could not get resource 'https://<internalRepo path>/com/jetbrains/ideaLocal/IU-191.7479.19/ideaLocal-IU-191.7479.19.pom'.
> Could not GET 'https://<internalRepo path>/com/jetbrains/ideaLocal/IU-191.7479.19/ideaLocal-IU-191.7479.19.pom'.
> sun.security.validator.ValidatorException: PKIX path building failed: sun.security.provider.certpath.SunCertPathBuilderException: unable to find valid certification path to requested target
> Could not resolve com.jetbrains:ideaLocal:IU-191.7479.19.
> Could not get resource 'https://<internalRepo path>/com/jetbrains/ideaLocal/IU-191.7479.19/ideaLocal-IU-191.7479.19.pom'.
> Could not GET 'https://<internalRepo path>/com/jetbrains/ideaLocal/IU-191.7479.19/ideaLocal-IU-191.7479.19.pom'.
> sun.security.validator.ValidatorException: PKIX path building failed: sun.security.provider.certpath.SunCertPathBuilderException: unable to find valid certification path to requested target

* Try:
Run with --debug option to get more log output. Run with --scan to get full insights.

* Exception is:
org.gradle.api.internal.artifacts.ivyservice.DefaultLenientConfiguration$ArtifactResolveException: Could not resolve all files for configuration ':compileClasspath'.
at org.gradle.api.internal.artifacts.configurations.DefaultConfiguration.rethrowFailure(DefaultConfiguration.java:1054)
at org.gradle.api.internal.artifacts.configurations.DefaultConfiguration.access$1700(DefaultConfiguration.java:123)
at org.gradle.api.internal.artifacts.configurations.DefaultConfiguration$ConfigurationFileCollection.getFiles(DefaultConfiguration.java:1028)
at org.gradle.api.internal.file.AbstractFileCollection.iterator(AbstractFileCollection.java:76)
at org.gradle.api.internal.artifacts.configurations.DefaultConfiguration.iterator(DefaultConfiguration.java:439)
at org.gradle.api.internal.changedetection.state.DefaultFileSystemSnapshotter$FileCollectionVisitorImpl.visitCollection(DefaultFileSystemSnapshotter.java:254)
at org.gradle.api.internal.file.AbstractFileCollection.visitRootElements(AbstractFileCollection.java:282)
at org.gradle.api.internal.file.CompositeFileCollection.visitRootElements(CompositeFileCollection.java:206)
at org.gradle.api.internal.changedetection.state.DefaultFileSystemSnapshotter.snapshot(DefaultFileSystemSnapshotter.java:139)
at org.gradle.internal.fingerprint.impl.AbstractFileCollectionFingerprinter.fingerprint(AbstractFileCollectionFingerprinter.java:54)
at org.gradle.internal.fingerprint.impl.DefaultCompileClasspathFingerprinter.fingerprint(DefaultCompileClasspathFingerprinter.java:46)
at org.gradle.api.internal.changedetection.state.CacheBackedTaskHistoryRepository.fingerprintTaskFiles(CacheBackedTaskHistoryRepository.java:358)
at org.gradle.api.internal.changedetection.state.CacheBackedTaskHistoryRepository.createExecution(CacheBackedTaskHistoryRepository.java:163)
at org.gradle.api.internal.changedetection.state.CacheBackedTaskHistoryRepository.access$100(CacheBackedTaskHistoryRepository.java:76)
at org.gradle.api.internal.changedetection.state.CacheBackedTaskHistoryRepository$1.getCurrentExecution(CacheBackedTaskHistoryRepository.java:123)
at org.gradle.api.internal.changedetection.changes.DefaultTaskArtifactStateRepository$TaskArtifactStateImpl.calculateCacheKey(DefaultTaskArtifactStateRepository.java:125)
at org.gradle.api.internal.tasks.execution.ResolveBuildCacheKeyExecuter.doResolve(ResolveBuildCacheKeyExecuter.java:119)
at org.gradle.api.internal.tasks.execution.ResolveBuildCacheKeyExecuter.access$000(ResolveBuildCacheKeyExecuter.java:61)
at org.gradle.api.internal.tasks.execution.ResolveBuildCacheKeyExecuter$1.run(ResolveBuildCacheKeyExecuter.java:103)
at org.gradle.internal.operations.DefaultBuildOperationExecutor$RunnableBuildOperationWorker.execute(DefaultBuildOperationExecutor.java:300)
at org.gradle.internal.operations.DefaultBuildOperationExecutor$RunnableBuildOperationWorker.execute(DefaultBuildOperationExecutor.java:292)
at org.gradle.internal.operations.DefaultBuildOperationExecutor.execute(DefaultBuildOperationExecutor.java:174)
at org.gradle.internal.operations.DefaultBuildOperationExecutor.run(DefaultBuildOperationExecutor.java:90)
at org.gradle.internal.operations.DelegatingBuildOperationExecutor.run(DelegatingBuildOperationExecutor.java:31)
at org.gradle.api.internal.tasks.execution.ResolveBuildCacheKeyExecuter.resolve(ResolveBuildCacheKeyExecuter.java:100)
at org.gradle.api.internal.tasks.execution.ResolveBuildCacheKeyExecuter.execute(ResolveBuildCacheKeyExecuter.java:78)
at org.gradle.api.internal.tasks.execution.ValidatingTaskExecuter.execute(ValidatingTaskExecuter.java:59)
at org.gradle.api.internal.tasks.execution.SkipEmptySourceFilesTaskExecuter.execute(SkipEmptySourceFilesTaskExecuter.java:101)
at org.gradle.api.internal.tasks.execution.FinalizeInputFilePropertiesTaskExecuter.execute(FinalizeInputFilePropertiesTaskExecuter.java:44)
at org.gradle.api.internal.tasks.execution.CleanupStaleOutputsExecuter.execute(CleanupStaleOutputsExecuter.java:91)
at org.gradle.api.internal.tasks.execution.ResolveTaskArtifactStateTaskExecuter.execute(ResolveTaskArtifactStateTaskExecuter.java:62)
at org.gradle.api.internal.tasks.execution.SkipTaskWithNoActionsExecuter.execute(SkipTaskWithNoActionsExecuter.java:59)
at org.gradle.api.internal.tasks.execution.SkipOnlyIfTaskExecuter.execute(SkipOnlyIfTaskExecuter.java:54)
at org.gradle.api.internal.tasks.execution.ExecuteAtMostOnceTaskExecuter.execute(ExecuteAtMostOnceTaskExecuter.java:43)
at org.gradle.api.internal.tasks.execution.CatchExceptionTaskExecuter.execute(CatchExceptionTaskExecuter.java:34)
at org.gradle.api.internal.tasks.execution.EventFiringTaskExecuter$1.run(EventFiringTaskExecuter.java:51)
at org.gradle.internal.operations.DefaultBuildOperationExecutor$RunnableBuildOperationWorker.execute(DefaultBuildOperationExecutor.java:300)
at org.gradle.internal.operations.DefaultBuildOperationExecutor$RunnableBuildOperationWorker.execute(DefaultBuildOperationExecutor.java:292)
at org.gradle.internal.operations.DefaultBuildOperationExecutor.execute(DefaultBuildOperationExecutor.java:174)
at org.gradle.internal.operations.DefaultBuildOperationExecutor.run(DefaultBuildOperationExecutor.java:90)
at org.gradle.internal.operations.DelegatingBuildOperationExecutor.run(DelegatingBuildOperationExecutor.java:31)
at org.gradle.api.internal.tasks.execution.EventFiringTaskExecuter.execute(EventFiringTaskExecuter.java:46)
at org.gradle.execution.taskgraph.LocalTaskInfoExecutor.execute(LocalTaskInfoExecutor.java:42)
at org.gradle.execution.taskgraph.DefaultTaskExecutionGraph$BuildOperationAwareWorkItemExecutor.execute(DefaultTaskExecutionGraph.java:277)
at org.gradle.execution.taskgraph.DefaultTaskExecutionGraph$BuildOperationAwareWorkItemExecutor.execute(DefaultTaskExecutionGraph.java:262)
at org.gradle.execution.taskgraph.DefaultTaskPlanExecutor$ExecutorWorker$1.execute(DefaultTaskPlanExecutor.java:135)
at org.gradle.execution.taskgraph.DefaultTaskPlanExecutor$ExecutorWorker$1.execute(DefaultTaskPlanExecutor.java:130)
at org.gradle.execution.taskgraph.DefaultTaskPlanExecutor$ExecutorWorker.execute(DefaultTaskPlanExecutor.java:200)
at org.gradle.execution.taskgraph.DefaultTaskPlanExecutor$ExecutorWorker.executeWithWork(DefaultTaskPlanExecutor.java:191)
at org.gradle.execution.taskgraph.DefaultTaskPlanExecutor$ExecutorWorker.run(DefaultTaskPlanExecutor.java:130)
at org.gradle.internal.concurrent.ExecutorPolicy$CatchAndRecordFailures.onExecute(ExecutorPolicy.java:63)
at org.gradle.internal.concurrent.ManagedExecutorImpl$1.run(ManagedExecutorImpl.java:46)
at org.gradle.internal.concurrent.ThreadFactoryImpl$ManagedThreadRunnable.run(ThreadFactoryImpl.java:55)
Caused by: org.gradle.internal.resolve.ModuleVersionResolveException: Could not resolve com.jetbrains:ideaLocal:IU-191.7479.19.
Required by:
project :
at org.gradle.api.internal.artifacts.ivyservice.ivyresolve.RepositoryChainComponentMetaDataResolver.resolveModule(RepositoryChainComponentMetaDataResolver.java:103)
at org.gradle.api.internal.artifacts.ivyservice.ivyresolve.RepositoryChainComponentMetaDataResolver.resolve(RepositoryChainComponentMetaDataResolver.java:63)
at org.gradle.api.internal.artifacts.ivyservice.resolveengine.ComponentResolversChain$ComponentMetaDataResolverChain.resolve(ComponentResolversChain.java:94)
at org.gradle.api.internal.artifacts.ivyservice.clientmodule.ClientModuleResolver.resolve(ClientModuleResolver.java:62)
at org.gradle.api.internal.artifacts.ivyservice.resolveengine.graph.builder.ComponentState.resolve(ComponentState.java:208)
at org.gradle.api.internal.artifacts.ivyservice.resolveengine.graph.builder.ComponentState.resolve(ComponentState.java:196)
at org.gradle.api.internal.artifacts.ivyservice.resolveengine.graph.builder.ComponentState.getMetadata(ComponentState.java:152)
at org.gradle.api.internal.artifacts.ivyservice.resolveengine.graph.builder.EdgeState.calculateTargetConfigurations(EdgeState.java:156)
at org.gradle.api.internal.artifacts.ivyservice.resolveengine.graph.builder.EdgeState.attachToTargetConfigurations(EdgeState.java:112)
at org.gradle.api.internal.artifacts.ivyservice.resolveengine.graph.builder.DependencyGraphBuilder.attachToTargetRevisionsSerially(DependencyGraphBuilder.java:315)
at org.gradle.api.internal.artifacts.ivyservice.resolveengine.graph.builder.DependencyGraphBuilder.resolveEdges(DependencyGraphBuilder.java:202)
at org.gradle.api.internal.artifacts.ivyservice.resolveengine.graph.builder.DependencyGraphBuilder.traverseGraph(DependencyGraphBuilder.java:155)
at org.gradle.api.internal.artifacts.ivyservice.resolveengine.graph.builder.DependencyGraphBuilder.resolve(DependencyGraphBuilder.java:126)
at org.gradle.api.internal.artifacts.ivyservice.resolveengine.DefaultArtifactDependencyResolver.resolve(DefaultArtifactDependencyResolver.java:123)
at org.gradle.api.internal.artifacts.ivyservice.DefaultConfigurationResolver.resolveGraph(DefaultConfigurationResolver.java:167)
at org.gradle.api.internal.artifacts.ivyservice.ShortCircuitEmptyConfigurationResolver.resolveGraph(ShortCircuitEmptyConfigurationResolver.java:89)
at org.gradle.api.internal.artifacts.ivyservice.ErrorHandlingConfigurationResolver.resolveGraph(ErrorHandlingConfigurationResolver.java:73)
at org.gradle.api.internal.artifacts.configurations.DefaultConfiguration$5.run(DefaultConfiguration.java:533)
at org.gradle.internal.operations.DefaultBuildOperationExecutor$RunnableBuildOperationWorker.execute(DefaultBuildOperationExecutor.java:300)
at org.gradle.internal.operations.DefaultBuildOperationExecutor$RunnableBuildOperationWorker.execute(DefaultBuildOperationExecutor.java:292)
at org.gradle.internal.operations.DefaultBuildOperationExecutor.execute(DefaultBuildOperationExecutor.java:174)
at org.gradle.internal.operations.DefaultBuildOperationExecutor.run(DefaultBuildOperationExecutor.java:90)
at org.gradle.internal.operations.DelegatingBuildOperationExecutor.run(DelegatingBuildOperationExecutor.java:31)
at org.gradle.api.internal.artifacts.configurations.DefaultConfiguration.resolveGraphIfRequired(DefaultConfiguration.java:524)
at org.gradle.api.internal.artifacts.configurations.DefaultConfiguration.resolveToStateOrLater(DefaultConfiguration.java:509)
at org.gradle.api.internal.artifacts.configurations.DefaultConfiguration.access$1800(DefaultConfiguration.java:123)
at org.gradle.api.internal.artifacts.configurations.DefaultConfiguration$ConfigurationFileCollection.getSelectedArtifacts(DefaultConfiguration.java:1037)
at org.gradle.api.internal.artifacts.configurations.DefaultConfiguration$ConfigurationFileCollection.getFiles(DefaultConfiguration.java:1025)
... 50 more
Caused by: org.gradle.internal.resolve.ModuleVersionResolveException: Could not resolve com.jetbrains:ideaLocal:IU-191.7479.19.
at org.gradle.api.internal.artifacts.ivyservice.ivyresolve.ErrorHandlingModuleComponentRepository$ErrorHandlingModuleComponentRepositoryAccess.resolveComponentMetaData(ErrorHandlingModuleComponentRepository.java:141)
at org.gradle.api.internal.artifacts.ivyservice.ivyresolve.ComponentMetaDataResolveState.process(ComponentMetaDataResolveState.java:75)
at org.gradle.api.internal.artifacts.ivyservice.ivyresolve.ComponentMetaDataResolveState.resolve(ComponentMetaDataResolveState.java:50)
at org.gradle.api.internal.artifacts.ivyservice.ivyresolve.RepositoryChainComponentMetaDataResolver.findBestMatch(RepositoryChainComponentMetaDataResolver.java:138)
at org.gradle.api.internal.artifacts.ivyservice.ivyresolve.RepositoryChainComponentMetaDataResolver.findBestMatch(RepositoryChainComponentMetaDataResolver.java:119)
at org.gradle.api.internal.artifacts.ivyservice.ivyresolve.RepositoryChainComponentMetaDataResolver.resolveModule(RepositoryChainComponentMetaDataResolver.java:92)
... 77 more
Caused by: java.lang.NoClassDefFoundError: com/mercury/ftjadin/hooks/interfaces/EventListenerListHookQTJA
at org.apache.ivy.core.event.EventManager.addTransferListener(EventManager.java:70)
at org.apache.ivy.Ivy.bind(Ivy.java:303)
at org.apache.ivy.Ivy.newInstance(Ivy.java:200)
at org.gradle.api.internal.artifacts.ivyservice.DefaultIvyContextManager$1.create(DefaultIvyContextManager.java:100)
at org.gradle.api.internal.artifacts.ivyservice.DefaultIvyContextManager$1.create(DefaultIvyContextManager.java:97)
at org.gradle.internal.SystemProperties.withSystemProperties(SystemProperties.java:148)
at org.gradle.api.internal.artifacts.ivyservice.DefaultIvyContextManager.createNewIvyInstance(DefaultIvyContextManager.java:97)
at org.gradle.api.internal.artifacts.ivyservice.DefaultIvyContextManager.getIvy(DefaultIvyContextManager.java:88)
at org.gradle.api.internal.artifacts.ivyservice.DefaultIvyContextManager.withIvy(DefaultIvyContextManager.java:60)
at org.gradle.api.internal.artifacts.ivyservice.IvyContextualMetaDataParser.parseMetaData(IvyContextualMetaDataParser.java:40)
at org.gradle.api.internal.artifacts.repositories.metadata.DefaultIvyDescriptorMetadataSource.parseMetaDataFromResource(DefaultIvyDescriptorMetadataSource.java:47)
at org.gradle.api.internal.artifacts.repositories.metadata.DefaultIvyDescriptorMetadataSource.parseMetaDataFromResource(DefaultIvyDescriptorMetadataSource.java:36)
at org.gradle.api.internal.artifacts.repositories.metadata.AbstractRepositoryMetadataSource.parseMetaDataFromArtifact(AbstractRepositoryMetadataSource.java:72)
at org.gradle.api.internal.artifacts.repositories.metadata.AbstractRepositoryMetadataSource.create(AbstractRepositoryMetadataSource.java:59)
at org.gradle.api.internal.artifacts.repositories.resolver.ExternalResourceResolver.resolveStaticDependency(ExternalResourceResolver.java:244)
at org.gradle.api.internal.artifacts.repositories.resolver.ExternalResourceResolver.doResolveComponentMetaData(ExternalResourceResolver.java:239)
at org.gradle.api.internal.artifacts.repositories.resolver.ExternalResourceResolver$RemoteRepositoryAccess.resolveComponentMetaData(ExternalResourceResolver.java:445)
at org.gradle.api.internal.artifacts.ivyservice.ivyresolve.CachingModuleComponentRepository$ResolveAndCacheRepositoryAccess.resolveComponentMetaData(CachingModuleComponentRepository.java:378)
at org.gradle.api.internal.artifacts.ivyservice.ivyresolve.LocalModuleComponentRepository$LocalAccess.resolveComponentMetaData(LocalModuleComponentRepository.java:74)
at org.gradle.api.internal.artifacts.ivyservice.ivyresolve.ErrorHandlingModuleComponentRepository$ErrorHandlingModuleComponentRepositoryAccess.resolveComponentMetaData(ErrorHandlingModuleComponentRepository.java:138)
... 82 more


* Get more help at https://help.gradle.org

BUILD FAILED in 5s
1 actionable task: 1 executed

 

 

 

0
Comment actions Permalink

please attach the content of ideaLocal-IU-191.7479.19-withKotlin.xml

0
Comment actions Permalink

`If it is so, try to fix the exception or try to upgrade java or gradle.` - Same configurations are working in environment with internet access.

It may be some issue with resolve logic from localPath in gradle-intellij-plugin where it is using default repository paths for resolving dependencies of IDE configured in localPath. 

 

Please find content of  ideaLocal-IU-191.7479.19-withKotlin.xml

<?xml version="1.0" encoding="UTF-8"?>
<ivy-module version="2.0">
<info organisation="com.jetbrains" module="ideaLocal" revision="IU-191.7479.19" publication="20200204201040"/>
<configurations>
<conf name="default" visibility="public"/>
<conf name="compile" visibility="public"/>
<conf name="sources" visibility="public"/>
</configurations>
<publications>
<artifact name="lib/aapt-proto-jarjar" type="jar" ext="jar" conf="compile"/>
<artifact name="lib/aether-api-1.1.0" type="jar" ext="jar" conf="compile"/>
<artifact name="lib/aether-connector-basic-1.1.0" type="jar" ext="jar" conf="compile"/>
<artifact name="lib/aether-dependency-resolver" type="jar" ext="jar" conf="compile"/>
<artifact name="lib/aether-impl-1.1.0" type="jar" ext="jar" conf="compile"/>
<artifact name="lib/aether-spi-1.1.0" type="jar" ext="jar" conf="compile"/>
<artifact name="lib/aether-transport-file-1.1.0" type="jar" ext="jar" conf="compile"/>
<artifact name="lib/aether-transport-http-1.1.0" type="jar" ext="jar" conf="compile"/>
<artifact name="lib/aether-util-1.1.0" type="jar" ext="jar" conf="compile"/>
<artifact name="lib/annotations" type="jar" ext="jar" conf="compile"/>
<artifact name="lib/asm-5.0.3" type="jar" ext="jar" conf="compile"/>
<artifact name="lib/asm-all-7.0.1" type="jar" ext="jar" conf="compile"/>
<artifact name="lib/asm-analysis-5.0.3" type="jar" ext="jar" conf="compile"/>
<artifact name="lib/asm-tree-5.0.3" type="jar" ext="jar" conf="compile"/>
<artifact name="lib/async-profiler-1.5-ea" type="jar" ext="jar" conf="compile"/>
<artifact name="lib/automaton-1.12-1" type="jar" ext="jar" conf="compile"/>
<artifact name="lib/baksmali-2.2.1" type="jar" ext="jar" conf="compile"/>
<artifact name="lib/batik-all-1.10" type="jar" ext="jar" conf="compile"/>
<artifact name="lib/bcprov-jdk15on-1.60" type="jar" ext="jar" conf="compile"/>
<artifact name="lib/bootstrap" type="jar" ext="jar" conf="compile"/>
<artifact name="lib/cglib-nodep-3.2.4" type="jar" ext="jar" conf="compile"/>
<artifact name="lib/cli-parser-1.1.2" type="jar" ext="jar" conf="compile"/>
<artifact name="lib/cloud-config-client" type="jar" ext="jar" conf="compile"/>
<artifact name="lib/common-image-3.4.1" type="jar" ext="jar" conf="compile"/>
<artifact name="lib/common-io-3.4.1" type="jar" ext="jar" conf="compile"/>
<artifact name="lib/common-lang-3.4.1" type="jar" ext="jar" conf="compile"/>
<artifact name="lib/commons-codec-1.10" type="jar" ext="jar" conf="compile"/>
<artifact name="lib/commons-collections-3.2.2" type="jar" ext="jar" conf="compile"/>
<artifact name="lib/commons-compress-1.18" type="jar" ext="jar" conf="compile"/>
<artifact name="lib/commons-httpclient-3.1-patched" type="jar" ext="jar" conf="compile"/>
<artifact name="lib/commons-imaging-1.0-RC-1" type="jar" ext="jar" conf="compile"/>
<artifact name="lib/commons-io-2.6" type="jar" ext="jar" conf="compile"/>
<artifact name="lib/commons-lang-2.4" type="jar" ext="jar" conf="compile"/>
<artifact name="lib/commons-lang3-3.4" type="jar" ext="jar" conf="compile"/>
<artifact name="lib/commons-logging-1.2" type="jar" ext="jar" conf="compile"/>
<artifact name="lib/commons-net-3.6" type="jar" ext="jar" conf="compile"/>
<artifact name="lib/cucumber-java-1.2.5" type="jar" ext="jar" conf="compile"/>
<artifact name="lib/debugger-memory-agent-0.0.11" type="jar" ext="jar" conf="compile"/>
<artifact name="lib/delight-rhino-sandbox-0.0.9" type="jar" ext="jar" conf="compile"/>
<artifact name="lib/dexlib2-2.2.1" type="jar" ext="jar" conf="compile"/>
<artifact name="lib/ecj-4.10" type="jar" ext="jar" conf="compile"/>
<artifact name="lib/eddsa-0.2.0" type="jar" ext="jar" conf="compile"/>
<artifact name="lib/error_prone_annotations-2.3.1" type="jar" ext="jar" conf="compile"/>
<artifact name="lib/extensions" type="jar" ext="jar" conf="compile"/>
<artifact name="lib/external-system-impl" type="jar" ext="jar" conf="compile"/>
<artifact name="lib/external-system-rt" type="jar" ext="jar" conf="compile"/>
<artifact name="lib/FastInfoset-1.2.15" type="jar" ext="jar" conf="compile"/>
<artifact name="lib/fluent-hc-4.5.6" type="jar" ext="jar" conf="compile"/>
<artifact name="lib/forms-1.1-preview" type="jar" ext="jar" conf="compile"/>
<artifact name="lib/forms_rt" type="jar" ext="jar" conf="compile"/>
<artifact name="lib/fst-2.57" type="jar" ext="jar" conf="compile"/>
<artifact name="lib/groovy-all-2.4.15" type="jar" ext="jar" conf="compile"/>
<artifact name="lib/gson-2.8.5" type="jar" ext="jar" conf="compile"/>
<artifact name="lib/guava-25.1-jre" type="jar" ext="jar" conf="compile"/>
<artifact name="lib/hamcrest-core-1.3" type="jar" ext="jar" conf="compile"/>
<artifact name="lib/httpclient-4.5.6" type="jar" ext="jar" conf="compile"/>
<artifact name="lib/httpcore-4.4.10" type="jar" ext="jar" conf="compile"/>
<artifact name="lib/httpmime-4.5.6" type="jar" ext="jar" conf="compile"/>
<artifact name="lib/icons" type="jar" ext="jar" conf="compile"/>
<artifact name="lib/ide-model-0.191.24" type="jar" ext="jar" conf="compile"/>
<artifact name="lib/idea-jsp-openapi" type="jar" ext="jar" conf="compile"/>
<artifact name="lib/idea" type="jar" ext="jar" conf="compile"/>
<artifact name="lib/idea_rt" type="jar" ext="jar" conf="compile"/>
<artifact name="lib/ideax" type="jar" ext="jar" conf="compile"/>
<artifact name="lib/imageio-core-3.4.1" type="jar" ext="jar" conf="compile"/>
<artifact name="lib/imageio-metadata-3.4.1" type="jar" ext="jar" conf="compile"/>
<artifact name="lib/imageio-tiff-3.4.1" type="jar" ext="jar" conf="compile"/>
<artifact name="lib/imgscalr-lib-4.2" type="jar" ext="jar" conf="compile"/>
<artifact name="lib/ini4j-0.5.5-2" type="jar" ext="jar" conf="compile"/>
<artifact name="lib/intellij-coverage-agent-1.0.495" type="jar" ext="jar" conf="compile"/>
<artifact name="lib/intellij-test-discovery-agent-1.0.495" type="jar" ext="jar" conf="compile"/>
<artifact name="lib/isorelax-20030108" type="jar" ext="jar" conf="compile"/>
<artifact name="lib/istack-commons-runtime-3.0.7" type="jar" ext="jar" conf="compile"/>
<artifact name="lib/jackson-annotations-2.9.0" type="jar" ext="jar" conf="compile"/>
<artifact name="lib/jackson-core-2.9.7" type="jar" ext="jar" conf="compile"/>
<artifact name="lib/jackson-databind-2.9.7" type="jar" ext="jar" conf="compile"/>
<artifact name="lib/java-api" type="jar" ext="jar" conf="compile"/>
<artifact name="lib/java-compatibility-1.0.1" type="jar" ext="jar" conf="compile"/>
<artifact name="lib/java-impl" type="jar" ext="jar" conf="compile"/>
<artifact name="lib/java_resources_en" type="jar" ext="jar" conf="compile"/>
<artifact name="lib/javac2" type="jar" ext="jar" conf="compile"/>
<artifact name="lib/javahelp-2.0.02" type="jar" ext="jar" conf="compile"/>
<artifact name="lib/javassist-3.22.0-GA" type="jar" ext="jar" conf="compile"/>
<artifact name="lib/javax.activation-1.2.0" type="jar" ext="jar" conf="compile"/>
<artifact name="lib/javax.annotation-api-1.3.2" type="jar" ext="jar" conf="compile"/>
<artifact name="lib/jaxb-api-2.3.1" type="jar" ext="jar" conf="compile"/>
<artifact name="lib/jaxb-runtime-2.3.1" type="jar" ext="jar" conf="compile"/>
<artifact name="lib/jaxen-1.1.6" type="jar" ext="jar" conf="compile"/>
<artifact name="lib/jbcrypt-1.0.0" type="jar" ext="jar" conf="compile"/>
<artifact name="lib/jcip-annotations-1.0" type="jar" ext="jar" conf="compile"/>
<artifact name="lib/jdkAnnotations" type="jar" ext="jar" conf="compile"/>
<artifact name="lib/jdom" type="jar" ext="jar" conf="compile"/>
<artifact name="lib/jediterm-pty-2.14" type="jar" ext="jar" conf="compile"/>
<artifact name="lib/jetCheck-0.2.1" type="jar" ext="jar" conf="compile"/>
<artifact name="lib/jettison-1.4.0" type="jar" ext="jar" conf="compile"/>
<artifact name="lib/jfr-reader-0.1.1" type="jar" ext="jar" conf="compile"/>
<artifact name="lib/jgoodies-common-1.4.0" type="jar" ext="jar" conf="compile"/>
<artifact name="lib/jing-20030619" type="jar" ext="jar" conf="compile"/>
<artifact name="lib/jna-platform" type="jar" ext="jar" conf="compile"/>
<artifact name="lib/jna" type="jar" ext="jar" conf="compile"/>
<artifact name="lib/jps-builders-6" type="jar" ext="jar" conf="compile"/>
<artifact name="lib/jps-builders" type="jar" ext="jar" conf="compile"/>
<artifact name="lib/jps-launcher" type="jar" ext="jar" conf="compile"/>
<artifact name="lib/jps-model" type="jar" ext="jar" conf="compile"/>
<artifact name="lib/jsch-0.1.55" type="jar" ext="jar" conf="compile"/>
<artifact name="lib/jsch.agentproxy.connector-factory" type="jar" ext="jar" conf="compile"/>
<artifact name="lib/jsch.agentproxy.core" type="jar" ext="jar" conf="compile"/>
<artifact name="lib/jsch.agentproxy.jsch" type="jar" ext="jar" conf="compile"/>
<artifact name="lib/jsch.agentproxy.pageant" type="jar" ext="jar" conf="compile"/>
<artifact name="lib/jsch.agentproxy.sshagent" type="jar" ext="jar" conf="compile"/>
<artifact name="lib/jsch.agentproxy.usocket-jna" type="jar" ext="jar" conf="compile"/>
<artifact name="lib/jsch.agentproxy.usocket-nc" type="jar" ext="jar" conf="compile"/>
<artifact name="lib/jshell-frontend" type="jar" ext="jar" conf="compile"/>
<artifact name="lib/jshell-protocol" type="jar" ext="jar" conf="compile"/>
<artifact name="lib/jsoup-1.11.3" type="jar" ext="jar" conf="compile"/>
<artifact name="lib/jsp-api" type="jar" ext="jar" conf="compile"/>
<artifact name="lib/junit-4.12" type="jar" ext="jar" conf="compile"/>
<artifact name="lib/junit" type="jar" ext="jar" conf="compile"/>
<artifact name="lib/jzlib-1.1.3" type="jar" ext="jar" conf="compile"/>
<artifact name="lib/kotlin-reflect-1.3.11" type="jar" ext="jar" conf="compile"/>
<artifact name="lib/kotlin-stdlib-1.3.11" type="jar" ext="jar" conf="compile"/>
<artifact name="lib/kotlin-stdlib-common-1.3.11" type="jar" ext="jar" conf="compile"/>
<artifact name="lib/kotlin-stdlib-jdk7-1.3.11" type="jar" ext="jar" conf="compile"/>
<artifact name="lib/kotlin-stdlib-jdk8-1.3.11" type="jar" ext="jar" conf="compile"/>
<artifact name="lib/kotlin-test-1.3.11" type="jar" ext="jar" conf="compile"/>
<artifact name="lib/kotlin-test-common-1.3.11" type="jar" ext="jar" conf="compile"/>
<artifact name="lib/kotlinx-coroutines-core-1.0.1" type="jar" ext="jar" conf="compile"/>
<artifact name="lib/kotlinx-coroutines-core-common-1.0.1" type="jar" ext="jar" conf="compile"/>
<artifact name="lib/kotlinx-coroutines-jdk8-1.0.1" type="jar" ext="jar" conf="compile"/>
<artifact name="lib/kxml2-2.3.0" type="jar" ext="jar" conf="compile"/>
<artifact name="lib/log4j" type="jar" ext="jar" conf="compile"/>
<artifact name="lib/lz4-1.3.0" type="jar" ext="jar" conf="compile"/>
<artifact name="lib/markdown4j-2.2-cj-1.1" type="jar" ext="jar" conf="compile"/>
<artifact name="lib/markdownj-core-0.4.2-SNAPSHOT" type="jar" ext="jar" conf="compile"/>
<artifact name="lib/maven-aether-provider-3.3.9" type="jar" ext="jar" conf="compile"/>
<artifact name="lib/maven-artifact-3.3.9" type="jar" ext="jar" conf="compile"/>
<artifact name="lib/maven-builder-support-3.3.9" type="jar" ext="jar" conf="compile"/>
<artifact name="lib/maven-model-3.3.9" type="jar" ext="jar" conf="compile"/>
<artifact name="lib/maven-model-builder-3.3.9" type="jar" ext="jar" conf="compile"/>
<artifact name="lib/maven-repository-metadata-3.3.9" type="jar" ext="jar" conf="compile"/>
<artifact name="lib/microba" type="jar" ext="jar" conf="compile"/>
<artifact name="lib/miglayout-core-5.2" type="jar" ext="jar" conf="compile"/>
<artifact name="lib/miglayout-swing-5.2" type="jar" ext="jar" conf="compile"/>
<artifact name="lib/nanoxml-2.2.3" type="jar" ext="jar" conf="compile"/>
<artifact name="lib/nekohtml-1.9.22" type="jar" ext="jar" conf="compile"/>
<artifact name="lib/netty-buffer-4.1.32.Final" type="jar" ext="jar" conf="compile"/>
<artifact name="lib/netty-codec-4.1.32.Final" type="jar" ext="jar" conf="compile"/>
<artifact name="lib/netty-codec-http-4.1.32.Final" type="jar" ext="jar" conf="compile"/>
<artifact name="lib/netty-common-4.1.32.Final" type="jar" ext="jar" conf="compile"/>
<artifact name="lib/netty-handler-4.1.32.Final" type="jar" ext="jar" conf="compile"/>
<artifact name="lib/netty-resolver-4.1.32.Final" type="jar" ext="jar" conf="compile"/>
<artifact name="lib/netty-transport-4.1.32.Final" type="jar" ext="jar" conf="compile"/>
<artifact name="lib/objenesis-2.6" type="jar" ext="jar" conf="compile"/>
<artifact name="lib/openapi" type="jar" ext="jar" conf="compile"/>
<artifact name="lib/org.eclipse.lsp4j-0.7.1" type="jar" ext="jar" conf="compile"/>
<artifact name="lib/org.eclipse.lsp4j.jsonrpc-0.7.1" type="jar" ext="jar" conf="compile"/>
<artifact name="lib/oro-2.0.8" type="jar" ext="jar" conf="compile"/>
<artifact name="lib/picocontainer-1.2" type="jar" ext="jar" conf="compile"/>
<artifact name="lib/platform-api" type="jar" ext="jar" conf="compile"/>
<artifact name="lib/platform-impl" type="jar" ext="jar" conf="compile"/>
<artifact name="lib/plexus-component-annotations-1.6" type="jar" ext="jar" conf="compile"/>
<artifact name="lib/plexus-interpolation-1.21" type="jar" ext="jar" conf="compile"/>
<artifact name="lib/plexus-utils-3.0.22" type="jar" ext="jar" conf="compile"/>
<artifact name="lib/protobuf-java-3.5.1" type="jar" ext="jar" conf="compile"/>
<artifact name="lib/proxy-vole-1.0.6" type="jar" ext="jar" conf="compile"/>
<artifact name="lib/pty4j-0.9.3" type="jar" ext="jar" conf="compile"/>
<artifact name="lib/purejavacomm-0.0.11.1" type="jar" ext="jar" conf="compile"/>
<artifact name="lib/rd-core-0.191.46" type="jar" ext="jar" conf="compile"/>
<artifact name="lib/rd-framework-0.191.46" type="jar" ext="jar" conf="compile"/>
<artifact name="lib/resources" type="jar" ext="jar" conf="compile"/>
<artifact name="lib/resources_en" type="jar" ext="jar" conf="compile"/>
<artifact name="lib/rhino-1.7.10" type="jar" ext="jar" conf="compile"/>
<artifact name="lib/rngom-20051226-patched" type="jar" ext="jar" conf="compile"/>
<artifact name="lib/sa-jdwp-1.12" type="jar" ext="jar" conf="compile"/>
<artifact name="lib/serviceMessages" type="jar" ext="jar" conf="compile"/>
<artifact name="lib/servlet-api" type="jar" ext="jar" conf="compile"/>
<artifact name="lib/slf4j-api-1.7.25" type="jar" ext="jar" conf="compile"/>
<artifact name="lib/slf4j-log4j12-1.7.25" type="jar" ext="jar" conf="compile"/>
<artifact name="lib/snakeyaml-1.23" type="jar" ext="jar" conf="compile"/>
<artifact name="lib/sqlite-jdbc-3.21.0.1" type="jar" ext="jar" conf="compile"/>
<artifact name="lib/stax-api-1.0.1" type="jar" ext="jar" conf="compile"/>
<artifact name="lib/stax-ex-1.8" type="jar" ext="jar" conf="compile"/>
<artifact name="lib/streamex-0.6.7" type="jar" ext="jar" conf="compile"/>
<artifact name="lib/swingx-core-1.6.2-2" type="jar" ext="jar" conf="compile"/>
<artifact name="lib/trang-core" type="jar" ext="jar" conf="compile"/>
<artifact name="lib/trilead-ssh2-build-217-jenkins-11" type="jar" ext="jar" conf="compile"/>
<artifact name="lib/trove4j" type="jar" ext="jar" conf="compile"/>
<artifact name="lib/txw2-2.3.1" type="jar" ext="jar" conf="compile"/>
<artifact name="lib/util-2.2.1" type="jar" ext="jar" conf="compile"/>
<artifact name="lib/util" type="jar" ext="jar" conf="compile"/>
<artifact name="lib/velocity-1.7" type="jar" ext="jar" conf="compile"/>
<artifact name="lib/wadl-core" type="jar" ext="jar" conf="compile"/>
<artifact name="lib/winp-1.28" type="jar" ext="jar" conf="compile"/>
<artifact name="lib/xercesImpl-2.12.0" type="jar" ext="jar" conf="compile"/>
<artifact name="lib/xml-apis-ext-1.3.04" type="jar" ext="jar" conf="compile"/>
<artifact name="lib/xml-resolver-1.2" type="jar" ext="jar" conf="compile"/>
<artifact name="lib/xmlbeans-2.6.0" type="jar" ext="jar" conf="compile"/>
<artifact name="lib/xmlgraphics-commons-2.3" type="jar" ext="jar" conf="compile"/>
<artifact name="lib/xmlpull-1.1.3.1" type="jar" ext="jar" conf="compile"/>
<artifact name="lib/xmlrpc-2.0.1" type="jar" ext="jar" conf="compile"/>
<artifact name="lib/xpp3_min-1.1.4c" type="jar" ext="jar" conf="compile"/>
<artifact name="lib/xstream-1.4.10" type="jar" ext="jar" conf="compile"/>
<artifact name="lib/xz-1.8" type="jar" ext="jar" conf="compile"/>
<artifact name="lib/yjp-controller-api-redist" type="jar" ext="jar" conf="compile"/>
</publications>
</ivy-module>

0
Comment actions Permalink

> `If it is so, try to fix the exception or try to upgrade java or gradle.` - Same configurations are working in environment with internet access.

It doesn't mean anything. IntelliJ cannot be resolved via https://cache-redirector.jetbrains.com/plugins.jetbrains.com/maven/com/jetbrains/ideaLocal/IU-191.7479.19/ideaLocal-IU-191.7479.19.pom' even with internet access.

ideaLocal-IU-191.7479.19-withKotlin.xml – this is the repo for IDE resolution and it looks ok. For some reason Gradle doesn't even try to resolve there if there is no internet connection. I'd say it's on Gradle or on your proxy.

> It may be some issue with resolve logic from localPath in gradle-intellij-plugin where it is using default repository paths for resolving dependencies of IDE configured in localPath. 

Gradle-intellij-plugin doesn't resolve artifacts. Gradle does. Maybe your proxy returns the results that Gradle cannot survive after. Anyway, it doesn't look like a problem of gradle-intellij-plugin, sorry.

0

Please sign in to leave a comment.