java.exe finished with non-zero exit value 1

Answered

I'm updating my plugin version to 2022.1, but after that I can't run any tasks such as "runIde", "buildPlugin", I got this exception:

FAILURE: Build failed with an exception.

* What went wrong:
Execution failed for task ':runIde'.
> Process 'command 'D:\dev\gradle\caches\modules-2\files-2.1\com.jetbrains\jbre\jbr_jcef-11_0_14_1-windows-x64-b2043.25\extracted\jbr\bin\java.exe'' finished with non-zero exit value 1

* Try:
> Run with --info or --debug option to get more log output.
> Run with --scan to get full insights.

* Exception is:
org.gradle.api.tasks.TaskExecutionException: Execution failed for task ':runIde'.
    at org.gradle.api.internal.tasks.execution.ExecuteActionsTaskExecuter.lambda$executeIfValid$1(ExecuteActionsTaskExecuter.java:145)
    at org.gradle.internal.Try$Failure.ifSuccessfulOrElse(Try.java:282)
    at org.gradle.api.internal.tasks.execution.ExecuteActionsTaskExecuter.executeIfValid(ExecuteActionsTaskExecuter.java:143)
    at org.gradle.api.internal.tasks.execution.ExecuteActionsTaskExecuter.execute(ExecuteActionsTaskExecuter.java:131)
    at org.gradle.api.internal.tasks.execution.CleanupStaleOutputsExecuter.execute(CleanupStaleOutputsExecuter.java:77)
    at org.gradle.api.internal.tasks.execution.FinalizePropertiesTaskExecuter.execute(FinalizePropertiesTaskExecuter.java:46)
    at org.gradle.api.internal.tasks.execution.ResolveTaskExecutionModeExecuter.execute(ResolveTaskExecutionModeExecuter.java:51)
    at org.gradle.api.internal.tasks.execution.SkipTaskWithNoActionsExecuter.execute(SkipTaskWithNoActionsExecuter.java:57)
    at org.gradle.api.internal.tasks.execution.SkipOnlyIfTaskExecuter.execute(SkipOnlyIfTaskExecuter.java:56)
    at org.gradle.api.internal.tasks.execution.CatchExceptionTaskExecuter.execute(CatchExceptionTaskExecuter.java:36)
    at org.gradle.api.internal.tasks.execution.EventFiringTaskExecuter$1.executeTask(EventFiringTaskExecuter.java:77)
    at org.gradle.api.internal.tasks.execution.EventFiringTaskExecuter$1.call(EventFiringTaskExecuter.java:55)
    at org.gradle.api.internal.tasks.execution.EventFiringTaskExecuter$1.call(EventFiringTaskExecuter.java:52)
    at org.gradle.internal.operations.DefaultBuildOperationRunner$CallableBuildOperationWorker.execute(DefaultBuildOperationRunner.java:204)
    at org.gradle.internal.operations.DefaultBuildOperationRunner$CallableBuildOperationWorker.execute(DefaultBuildOperationRunner.java:199)
    at org.gradle.internal.operations.DefaultBuildOperationRunner$2.execute(DefaultBuildOperationRunner.java:66)
    at org.gradle.internal.operations.DefaultBuildOperationRunner$2.execute(DefaultBuildOperationRunner.java:59)
    at org.gradle.internal.operations.DefaultBuildOperationRunner.execute(DefaultBuildOperationRunner.java:157)
    at org.gradle.internal.operations.DefaultBuildOperationRunner.execute(DefaultBuildOperationRunner.java:59)
    at org.gradle.internal.operations.DefaultBuildOperationRunner.call(DefaultBuildOperationRunner.java:53)
    at org.gradle.internal.operations.DefaultBuildOperationExecutor.call(DefaultBuildOperationExecutor.java:73)
    at org.gradle.api.internal.tasks.execution.EventFiringTaskExecuter.execute(EventFiringTaskExecuter.java:52)
    at org.gradle.execution.plan.LocalTaskNodeExecutor.execute(LocalTaskNodeExecutor.java:74)
    at org.gradle.execution.taskgraph.DefaultTaskExecutionGraph$InvokeNodeExecutorsAction.execute(DefaultTaskExecutionGraph.java:402)
    at org.gradle.execution.taskgraph.DefaultTaskExecutionGraph$InvokeNodeExecutorsAction.execute(DefaultTaskExecutionGraph.java:389)
    at org.gradle.execution.taskgraph.DefaultTaskExecutionGraph$BuildOperationAwareExecutionAction.execute(DefaultTaskExecutionGraph.java:382)
    at org.gradle.execution.taskgraph.DefaultTaskExecutionGraph$BuildOperationAwareExecutionAction.execute(DefaultTaskExecutionGraph.java:368)
    at org.gradle.execution.plan.DefaultPlanExecutor$ExecutorWorker.lambda$run$0(DefaultPlanExecutor.java:127)
    at org.gradle.execution.plan.DefaultPlanExecutor$ExecutorWorker.execute(DefaultPlanExecutor.java:191)
    at org.gradle.execution.plan.DefaultPlanExecutor$ExecutorWorker.executeNextNode(DefaultPlanExecutor.java:182)
    at org.gradle.execution.plan.DefaultPlanExecutor$ExecutorWorker.run(DefaultPlanExecutor.java:124)
    at org.gradle.internal.concurrent.ExecutorPolicy$CatchAndRecordFailures.onExecute(ExecutorPolicy.java:64)
    at org.gradle.internal.concurrent.ManagedExecutorImpl$1.run(ManagedExecutorImpl.java:48)
    at org.gradle.internal.concurrent.ThreadFactoryImpl$ManagedThreadRunnable.run(ThreadFactoryImpl.java:61)
Caused by: org.gradle.process.internal.ExecException: Process 'command 'D:\dev\gradle\caches\modules-2\files-2.1\com.jetbrains\jbre\jbr_jcef-11_0_14_1-windows-x64-b2043.25\extracted\jbr\bin\java.exe'' finished with non-zero exit value 1
    at org.gradle.process.internal.DefaultExecHandle$ExecResultImpl.assertNormalExitValue(DefaultExecHandle.java:414)
    at org.gradle.process.internal.DefaultJavaExecAction.execute(DefaultJavaExecAction.java:52)
    at org.gradle.api.tasks.JavaExec.exec(JavaExec.java:158)
    at org.jetbrains.intellij.tasks.RunIdeBase.exec(RunIdeBase.kt:97)
    at java.base/jdk.internal.reflect.NativeMethodAccessorImpl.invoke0(Native Method)
    at java.base/jdk.internal.reflect.NativeMethodAccessorImpl.invoke(NativeMethodAccessorImpl.java:62)
    at java.base/jdk.internal.reflect.DelegatingMethodAccessorImpl.invoke(DelegatingMethodAccessorImpl.java:43)
    at org.gradle.internal.reflect.JavaMethod.invoke(JavaMethod.java:104)
    at org.gradle.api.internal.project.taskfactory.StandardTaskAction.doExecute(StandardTaskAction.java:58)
    at org.gradle.api.internal.project.taskfactory.StandardTaskAction.execute(StandardTaskAction.java:51)
    at org.gradle.api.internal.project.taskfactory.StandardTaskAction.execute(StandardTaskAction.java:29)
    at org.gradle.api.internal.tasks.execution.TaskExecution$2.run(TaskExecution.java:239)
    at org.gradle.internal.operations.DefaultBuildOperationRunner$1.execute(DefaultBuildOperationRunner.java:29)
    at org.gradle.internal.operations.DefaultBuildOperationRunner$1.execute(DefaultBuildOperationRunner.java:26)
    at org.gradle.internal.operations.DefaultBuildOperationRunner$2.execute(DefaultBuildOperationRunner.java:66)
    at org.gradle.internal.operations.DefaultBuildOperationRunner$2.execute(DefaultBuildOperationRunner.java:59)
    at org.gradle.internal.operations.DefaultBuildOperationRunner.execute(DefaultBuildOperationRunner.java:157)
    at org.gradle.internal.operations.DefaultBuildOperationRunner.execute(DefaultBuildOperationRunner.java:59)
    at org.gradle.internal.operations.DefaultBuildOperationRunner.run(DefaultBuildOperationRunner.java:47)
    at org.gradle.internal.operations.DefaultBuildOperationExecutor.run(DefaultBuildOperationExecutor.java:68)
    at org.gradle.api.internal.tasks.execution.TaskExecution.executeAction(TaskExecution.java:224)
    at org.gradle.api.internal.tasks.execution.TaskExecution.executeActions(TaskExecution.java:207)
    at org.gradle.api.internal.tasks.execution.TaskExecution.executeWithPreviousOutputFiles(TaskExecution.java:190)
    at org.gradle.api.internal.tasks.execution.TaskExecution.execute(TaskExecution.java:168)
    at org.gradle.internal.execution.steps.ExecuteStep.executeInternal(ExecuteStep.java:89)
    at org.gradle.internal.execution.steps.ExecuteStep.access$000(ExecuteStep.java:40)
    at org.gradle.internal.execution.steps.ExecuteStep$1.call(ExecuteStep.java:53)
    at org.gradle.internal.execution.steps.ExecuteStep$1.call(ExecuteStep.java:50)
    at org.gradle.internal.operations.DefaultBuildOperationRunner$CallableBuildOperationWorker.execute(DefaultBuildOperationRunner.java:204)
    at org.gradle.internal.operations.DefaultBuildOperationRunner$CallableBuildOperationWorker.execute(DefaultBuildOperationRunner.java:199)
    at org.gradle.internal.operations.DefaultBuildOperationRunner$2.execute(DefaultBuildOperationRunner.java:66)
    at org.gradle.internal.operations.DefaultBuildOperationRunner$2.execute(DefaultBuildOperationRunner.java:59)
    at org.gradle.internal.operations.DefaultBuildOperationRunner.execute(DefaultBuildOperationRunner.java:157)
    at org.gradle.internal.operations.DefaultBuildOperationRunner.execute(DefaultBuildOperationRunner.java:59)
    at org.gradle.internal.operations.DefaultBuildOperationRunner.call(DefaultBuildOperationRunner.java:53)
    at org.gradle.internal.operations.DefaultBuildOperationExecutor.call(DefaultBuildOperationExecutor.java:73)
    at org.gradle.internal.execution.steps.ExecuteStep.execute(ExecuteStep.java:50)
    at org.gradle.internal.execution.steps.ExecuteStep.execute(ExecuteStep.java:40)
    at org.gradle.internal.execution.steps.RemovePreviousOutputsStep.execute(RemovePreviousOutputsStep.java:68)
    at org.gradle.internal.execution.steps.RemovePreviousOutputsStep.execute(RemovePreviousOutputsStep.java:38)
    at org.gradle.internal.execution.steps.ResolveInputChangesStep.execute(ResolveInputChangesStep.java:48)
    at org.gradle.internal.execution.steps.ResolveInputChangesStep.execute(ResolveInputChangesStep.java:36)
    at org.gradle.internal.execution.steps.CancelExecutionStep.execute(CancelExecutionStep.java:41)
    at org.gradle.internal.execution.steps.TimeoutStep.executeWithoutTimeout(TimeoutStep.java:74)
    at org.gradle.internal.execution.steps.TimeoutStep.execute(TimeoutStep.java:55)
    at org.gradle.internal.execution.steps.CreateOutputsStep.execute(CreateOutputsStep.java:51)
    at org.gradle.internal.execution.steps.CreateOutputsStep.execute(CreateOutputsStep.java:29)
    at org.gradle.internal.execution.steps.CaptureStateAfterExecutionStep.execute(CaptureStateAfterExecutionStep.java:61)
    at org.gradle.internal.execution.steps.CaptureStateAfterExecutionStep.execute(CaptureStateAfterExecutionStep.java:42)
    at org.gradle.internal.execution.steps.BroadcastChangingOutputsStep.execute(BroadcastChangingOutputsStep.java:60)
    at org.gradle.internal.execution.steps.BroadcastChangingOutputsStep.execute(BroadcastChangingOutputsStep.java:27)
    at org.gradle.internal.execution.steps.BuildCacheStep.executeWithoutCache(BuildCacheStep.java:188)
    at org.gradle.internal.execution.steps.BuildCacheStep.lambda$execute$1(BuildCacheStep.java:75)
    at org.gradle.internal.Either$Right.fold(Either.java:175)
    at org.gradle.internal.execution.caching.CachingState.fold(CachingState.java:59)
    at org.gradle.internal.execution.steps.BuildCacheStep.execute(BuildCacheStep.java:73)
    at org.gradle.internal.execution.steps.BuildCacheStep.execute(BuildCacheStep.java:48)
    at org.gradle.internal.execution.steps.StoreExecutionStateStep.execute(StoreExecutionStateStep.java:38)
    at org.gradle.internal.execution.steps.StoreExecutionStateStep.execute(StoreExecutionStateStep.java:27)
    at org.gradle.internal.execution.steps.RecordOutputsStep.execute(RecordOutputsStep.java:36)
    at org.gradle.internal.execution.steps.RecordOutputsStep.execute(RecordOutputsStep.java:22)
    at org.gradle.internal.execution.steps.SkipUpToDateStep.executeBecause(SkipUpToDateStep.java:109)
    at org.gradle.internal.execution.steps.SkipUpToDateStep.lambda$execute$2(SkipUpToDateStep.java:56)
    at org.gradle.internal.execution.steps.SkipUpToDateStep.execute(SkipUpToDateStep.java:56)
    at org.gradle.internal.execution.steps.SkipUpToDateStep.execute(SkipUpToDateStep.java:38)
    at org.gradle.internal.execution.steps.ResolveChangesStep.execute(ResolveChangesStep.java:73)
    at org.gradle.internal.execution.steps.ResolveChangesStep.execute(ResolveChangesStep.java:44)
    at org.gradle.internal.execution.steps.legacy.MarkSnapshottingInputsFinishedStep.execute(MarkSnapshottingInputsFinishedStep.java:37)
    at org.gradle.internal.execution.steps.legacy.MarkSnapshottingInputsFinishedStep.execute(MarkSnapshottingInputsFinishedStep.java:27)
    at org.gradle.internal.execution.steps.ResolveCachingStateStep.execute(ResolveCachingStateStep.java:89)
    at org.gradle.internal.execution.steps.ResolveCachingStateStep.execute(ResolveCachingStateStep.java:50)
    at org.gradle.internal.execution.steps.ValidateStep.execute(ValidateStep.java:114)
    at org.gradle.internal.execution.steps.ValidateStep.execute(ValidateStep.java:57)
    at org.gradle.internal.execution.steps.CaptureStateBeforeExecutionStep.execute(CaptureStateBeforeExecutionStep.java:76)
    at org.gradle.internal.execution.steps.CaptureStateBeforeExecutionStep.execute(CaptureStateBeforeExecutionStep.java:50)
    at org.gradle.internal.execution.steps.SkipEmptyWorkStep.lambda$execute$2(SkipEmptyWorkStep.java:93)
    at org.gradle.internal.execution.steps.SkipEmptyWorkStep.execute(SkipEmptyWorkStep.java:93)
    at org.gradle.internal.execution.steps.SkipEmptyWorkStep.execute(SkipEmptyWorkStep.java:34)
    at org.gradle.internal.execution.steps.legacy.MarkSnapshottingInputsStartedStep.execute(MarkSnapshottingInputsStartedStep.java:38)
    at org.gradle.internal.execution.steps.LoadPreviousExecutionStateStep.execute(LoadPreviousExecutionStateStep.java:43)
    at org.gradle.internal.execution.steps.LoadPreviousExecutionStateStep.execute(LoadPreviousExecutionStateStep.java:31)
    at org.gradle.internal.execution.steps.AssignWorkspaceStep.lambda$execute$0(AssignWorkspaceStep.java:40)
    at org.gradle.api.internal.tasks.execution.TaskExecution$3.withWorkspace(TaskExecution.java:284)
    at org.gradle.internal.execution.steps.AssignWorkspaceStep.execute(AssignWorkspaceStep.java:40)
    at org.gradle.internal.execution.steps.AssignWorkspaceStep.execute(AssignWorkspaceStep.java:30)
    at org.gradle.internal.execution.steps.IdentityCacheStep.execute(IdentityCacheStep.java:37)
    at org.gradle.internal.execution.steps.IdentityCacheStep.execute(IdentityCacheStep.java:27)
    at org.gradle.internal.execution.steps.IdentifyStep.execute(IdentifyStep.java:44)
    at org.gradle.internal.execution.steps.IdentifyStep.execute(IdentifyStep.java:33)
    at org.gradle.internal.execution.impl.DefaultExecutionEngine$1.execute(DefaultExecutionEngine.java:76)
    at org.gradle.api.internal.tasks.execution.ExecuteActionsTaskExecuter.executeIfValid(ExecuteActionsTaskExecuter.java:142)
    at org.gradle.api.internal.tasks.execution.ExecuteActionsTaskExecuter.execute(ExecuteActionsTaskExecuter.java:131)
    at org.gradle.api.internal.tasks.execution.CleanupStaleOutputsExecuter.execute(CleanupStaleOutputsExecuter.java:77)
    at org.gradle.api.internal.tasks.execution.FinalizePropertiesTaskExecuter.execute(FinalizePropertiesTaskExecuter.java:46)
    at org.gradle.api.internal.tasks.execution.ResolveTaskExecutionModeExecuter.execute(ResolveTaskExecutionModeExecuter.java:51)
    at org.gradle.api.internal.tasks.execution.SkipTaskWithNoActionsExecuter.execute(SkipTaskWithNoActionsExecuter.java:57)
    at org.gradle.api.internal.tasks.execution.SkipOnlyIfTaskExecuter.execute(SkipOnlyIfTaskExecuter.java:56)
    at org.gradle.api.internal.tasks.execution.CatchExceptionTaskExecuter.execute(CatchExceptionTaskExecuter.java:36)
    at org.gradle.api.internal.tasks.execution.EventFiringTaskExecuter$1.executeTask(EventFiringTaskExecuter.java:77)
    at org.gradle.api.internal.tasks.execution.EventFiringTaskExecuter$1.call(EventFiringTaskExecuter.java:55)
    at org.gradle.api.internal.tasks.execution.EventFiringTaskExecuter$1.call(EventFiringTaskExecuter.java:52)
    at org.gradle.internal.operations.DefaultBuildOperationRunner$CallableBuildOperationWorker.execute(DefaultBuildOperationRunner.java:204)
    at org.gradle.internal.operations.DefaultBuildOperationRunner$CallableBuildOperationWorker.execute(DefaultBuildOperationRunner.java:199)
    at org.gradle.internal.operations.DefaultBuildOperationRunner$2.execute(DefaultBuildOperationRunner.java:66)
    at org.gradle.internal.operations.DefaultBuildOperationRunner$2.execute(DefaultBuildOperationRunner.java:59)
    at org.gradle.internal.operations.DefaultBuildOperationRunner.execute(DefaultBuildOperationRunner.java:157)
    at org.gradle.internal.operations.DefaultBuildOperationRunner.execute(DefaultBuildOperationRunner.java:59)
    at org.gradle.internal.operations.DefaultBuildOperationRunner.call(DefaultBuildOperationRunner.java:53)
    at org.gradle.internal.operations.DefaultBuildOperationExecutor.call(DefaultBuildOperationExecutor.java:73)
    at org.gradle.api.internal.tasks.execution.EventFiringTaskExecuter.execute(EventFiringTaskExecuter.java:52)
    at org.gradle.execution.plan.LocalTaskNodeExecutor.execute(LocalTaskNodeExecutor.java:74)
    at org.gradle.execution.taskgraph.DefaultTaskExecutionGraph$InvokeNodeExecutorsAction.execute(DefaultTaskExecutionGraph.java:402)
    at org.gradle.execution.taskgraph.DefaultTaskExecutionGraph$InvokeNodeExecutorsAction.execute(DefaultTaskExecutionGraph.java:389)
    at org.gradle.execution.taskgraph.DefaultTaskExecutionGraph$BuildOperationAwareExecutionAction.execute(DefaultTaskExecutionGraph.java:382)
    at org.gradle.execution.taskgraph.DefaultTaskExecutionGraph$BuildOperationAwareExecutionAction.execute(DefaultTaskExecutionGraph.java:368)
    at org.gradle.execution.plan.DefaultPlanExecutor$ExecutorWorker.lambda$run$0(DefaultPlanExecutor.java:127)
    at org.gradle.execution.plan.DefaultPlanExecutor$ExecutorWorker.execute(DefaultPlanExecutor.java:191)
    at org.gradle.execution.plan.DefaultPlanExecutor$ExecutorWorker.executeNextNode(DefaultPlanExecutor.java:182)
    at org.gradle.execution.plan.DefaultPlanExecutor$ExecutorWorker.run(DefaultPlanExecutor.java:124)
    at org.gradle.internal.concurrent.ExecutorPolicy$CatchAndRecordFailures.onExecute(ExecutorPolicy.java:64)
    at org.gradle.internal.concurrent.ManagedExecutorImpl$1.run(ManagedExecutorImpl.java:48)
    at org.gradle.internal.concurrent.ThreadFactoryImpl$ManagedThreadRunnable.run(ThreadFactoryImpl.java:61)


* Get more help at https://help.gradle.org

BUILD FAILED in 7s

And here is my build.gradle.kts and gradle.properties file:

import org.jetbrains.changelog.markdownToHTML
import org.jetbrains.kotlin.gradle.tasks.KotlinCompile
fun properties(key: String) = project.findProperty(key).toString()

plugins {
id("java")
id("org.jetbrains.kotlin.jvm") version "1.6.20"
id("org.jetbrains.intellij") version "1.5.2"
id("org.jetbrains.changelog") version "1.3.1"
}

group = properties("pluginGroup")
version = properties("pluginVersion")

repositories {
mavenLocal()
mavenCentral()
}

sourceSets["main"].java.srcDirs("src/main/gen")

intellij {
version.set(properties("ideaVersion"))
downloadSources.set(properties("sources").toBoolean())
sameSinceUntilBuild.set(properties("isEAP").toBoolean())
plugins.set(listOf("copyright", "java", "PsiViewer:221-SNAPSHOT" ,"com.jetbrains.hackathon.indices.viewer:1.21"))
}

tasks {
properties("javaVersion").let {
withType<JavaCompile> {
sourceCompatibility = it
targetCompatibility = it
}
withType<KotlinCompile> {
kotlinOptions.jvmTarget = it
}
}

wrapper {
gradleVersion = properties("gradleVersion")
}

withType<JavaCompile> {
options.encoding = "UTF-8"
}

patchPluginXml {
version.set(properties("pluginVersion"))
sinceBuild.set(properties("sinceBuild"))
untilBuild.set(properties("untilBuild"))
pluginDescription.set(File(projectDir, "README.md").readText().lines().run {
val start = "<!-- Plugin description -->"
val end = "<!-- Plugin description end -->"
if (!containsAll(listOf(start, end))) {
throw GradleException("Plugin description section not found in README.md:\n$start ... $end")
}
subList(indexOf(start) + 1, indexOf(end))
}.joinToString("\n").run {
markdownToHTML(this) + "\n<p></p>"
})
changeNotes.set(provider { changelog.getLatest().toHTML() })
}
}

changelog {
version.set(properties("pluginVersion"))
}
pluginVersion = 1.0.3
pluginGroup = com.myplugin
# see https://www.jetbrains.com/idea/download/other.html
ideaVersion = IC-2022.1
sinceBuild = 211
untilBuild = 221.*
sources = true
isEAP = false
javaVersion = 11
gradleVersion = 7.3.3
kotlin.stdlib.default.dependency=false

I have no idea what happened, please help

0
6 comments

Hi,

I don't see what can be an issue. Did you try to use Gradle's hint: "Run with --info or --debug option to get more log output."? Is there more output?

I would try to increase your heap size and see if it helps. In the gradle.properties file add:

org.gradle.jvmargs=-Xmx4096m
 
Also, just a note - it is recommended to build the project against the lowest supported version, not the highest as in your case. A higher version may be useful to test the plugin in newer IDEs, but it should be used only for development purposes, not to build the final plugin distribution.
 
BTW, please update the Gradle plugin to the latest one - 1.5.3.
1

I've tried but still got this exception. Seems something went wrong with my configuration or computer case when I rollback my codes still not work.

Anyway, thanks for your help and advise.

0

I use another computer and this is not happen again...Though I don't know why this happen, but it's pretty sure that's my problem. Thanks again for your help @Karol Lewandowski

0

Hi, I am having the issue as discussed here:

finished with non-zero exit value 1

 

I am trying out Apache beam - exericse, as given in this code. https://tour.beam.apache.org/tour/java/introduction/beam-concepts/pipeline-concepts/setting-pipeline

 

When the execution hits for the pipeline to run, it errors out after

Caused by: org.gradle.process.internal.ExecException: Process 'command '/Library/Java/JavaVirtualMachines/jdk-17.0.1.jdk/Contents/Home/bin/java'' finished with non-zero exit value 1
    at org.gradle.process.internal.DefaultExecHandle$ExecResultImpl.assertNormalExitValue(DefaultExecHandle.java:414)
    at org.gradle.process.internal.DefaultJavaExecAction.execute(DefaultJavaExecAction.java:52)

 

--

 

Some one please tell me, I should be spending huge hours in this? please help

0

I am also facing the same issue. what is causing this issue and how to solve this ?

0

 

 

There are a number of possible reasons why the task might fail. Some potential causes include:

 

  • A Java runtime environment (JRE) is not installed or is not configured correctly. Make sure that you have the latest version of the JRE installed and that the JAVA_HOME environment variable is set to the correct path.
  • There are errors in your code. Check for any syntax errors, logic errors, or runtime errors in your code that might be preventing the program from running correctly.
  • There are missing or corrupted resources. Make sure that all of the required resources, such as images, sounds, and models, are present and in the correct locations.
  • There are compatibility issues between your application and your operating system. Make sure that you are using a version of your application that is compatible with your operating system.

To troubleshoot this issue, you can try the following:

  1. Check the Java console for any error messages. The Java console may contain additional information about the error that caused the program to exit.
  2. Run the application from the command line. This will allow you to see any error messages that are printed to the console.
  3. Use a debugger to step through your code and identify any errors that might be causing the program to fail.

 

0

Please sign in to leave a comment.